{"text_format":"1","workbook":"xlsx","n_sheets":6,"sheets":["Title","Tech Pay","Input Sheet","RO Report 1-50","RO Report 51-100","Summary Report"],"not_rendered":{"charts":1,"images":1,"macros":1,"external_links":0,"defined_names":1,"comments":2,"pivot_tables":0},"unopened":[],"bounds":{"document_bytes":16777216,"sheet_cells":100000,"rows_first":2000,"rows_last":500,"rows_between":2000,"halvings":0,"cell_chars":16384,"cell_head_chars":4096},"cells_cut":0,"cells_raw":0,"read":"whole","date_system":"1900"}

{"sheet":"Title","index":0,"n_rows":36,"n_cols":11,"rows_kept":36,"cut":false,"hidden":false,"merged":[[15,0,15,9],[16,0,16,9],[35,7,39,9]]}
[]
[]
[]
[]
[]
[]
[]
[]
[]
[]
[]
[]
[]
[]
[]
{"$rows_left_out":22}
{"sheet":"Tech Pay","index":1,"n_rows":7,"n_cols":4,"rows_kept":7,"cut":false,"hidden":false,"merged":[]}
[null,"Tech #","Tech Pay Per FRH"]
[]
[]
[]
[]
[]
[null,null,null,"          "]

{"sheet":"Input Sheet","index":2,"n_rows":113,"n_cols":23,"rows_kept":113,"cut":false,"hidden":false,"merged":[[107,20,108,20],[106,21,108,21],[106,22,108,22],[106,6,106,10],[3,10,4,10],[106,11,106,15],[106,16,106,20],[107,11,108,11],[107,12,108,12],[107,13,108,13],[107,14,108,14],[107,15,108,15],[107,16,108,16],[107,17,108,17],[3,18,4,18],[3,19,4,19],[107,18,108,18],[107,19,108,19],[107,6,108,6],[107,7,108,7],[107,8,108,8],[107,9,108,9],[107,10,108,10],[1,2,1,6],[2,21,4,21],[2,6,2,10],[2,11,2,15],[3,11,4,11],[3,12,4,12],[3,13,4,13],[3,14,4,14],[3,15,4,15],[3,6,4,6],[3,7,4,7],[3,8,4,8],[3,9,4,9],[3,20,4,20],[2,22,4,22],[3,2,4,2],[2,16,2,20],[3,16,4,16],[3,17,4,17],[3,3,4,3],[3,4,4,4],[3,5,4,5]]}
[]
[null,null,"Repair Order Analysis Input Sheet"]
[null,null,null,null,null,null,"Competitive Labor",null,null,null,null,"Maintenance Labor",null,null,null,null,"Repair Labor",null,null,null,null,"Total Cost of Labor","One Item Repair Order"]
[null,null,"RO Number","Year","Model ","Mileage","Labor Sales","Flat Rate Hours","Technican Number","Pay Per FRH","Labor Cost ","Labor Sales","Flat Rate Hours","Technican Number","Pay Per FRH","Labor Cost ","Labor Sales","Flat Rate Hours","Technican Number","Pay Per FRH","Labor Cost "]
[]
[null,1,null,null,null,null,null,null,null,{"$f":"IF(ISERROR(VLOOKUP('Input Sheet'!$I6,TechNumber,2,FALSE)),\"\",VLOOKUP('Input Sheet'!$I6,TechNumber,2,FALSE))","v":""},{"$f":"IF(ISERROR(H6*J6),\"\",H6*J6)","v":""},null,null,null,{"$f":"IF(ISERROR(VLOOKUP('Input Sheet'!$N6,TechNumber,2,FALSE)),\"\",VLOOKUP('Input Sheet'!$N6,TechNumber,2,FALSE))","v":""},{"$f":"IF(ISERROR(M6*O6),\" \",M6*O6)","v":" "},null,null,null,{"$f":"IF(ISERROR(VLOOKUP('Input Sheet'!$S6,TechNumber,2,FALSE)),\"\",VLOOKUP('Input Sheet'!$S6,TechNumber,2,FALSE))","v":""},{"$f":"IF(ISERROR(R6*T6),\"\",R6*T6)","v":""},{"$f":"SUM(U6,P6,K6)","v":0}]
[null,2,null,null,null,null,null,null,null,{"$f":"IF(ISERROR(VLOOKUP('Input Sheet'!$I7,TechNumber,2,FALSE)),\"\",VLOOKUP('Input Sheet'!$I7,TechNumber,2,FALSE))","v":""},"",null,null,null,{"$f":"IF(ISERROR(VLOOKUP('Input Sheet'!$N7,TechNumber,2,FALSE)),\"\",VLOOKUP('Input Sheet'!$N7,TechNumber,2,FALSE))","v":""}," ",null,null,null,{"$f":"IF(ISERROR(VLOOKUP('Input Sheet'!$S7,TechNumber,2,FALSE)),\"\",VLOOKUP('Input Sheet'!$S7,TechNumber,2,FALSE))","v":""},"",{"$f":"SUM(U7,P7,K7)","v":0}]
[null,3,null,null,null,null,null,null,null,{"$f":"IF(ISERROR(VLOOKUP('Input Sheet'!$I8,TechNumber,2,FALSE)),\"\",VLOOKUP('Input Sheet'!$I8,TechNumber,2,FALSE))","v":""},"",null,null,null,{"$f":"IF(ISERROR(VLOOKUP('Input Sheet'!$N8,TechNumber,2,FALSE)),\"\",VLOOKUP('Input Sheet'!$N8,TechNumber,2,FALSE))","v":""}," ",null,null,null,{"$f":"IF(ISERROR(VLOOKUP('Input Sheet'!$S8,TechNumber,2,FALSE)),\"\",VLOOKUP('Input Sheet'!$S8,TechNumber,2,FALSE))","v":""},"",0]
[null,4,null,null,null,null,null,null,null,{"$f":"IF(ISERROR(VLOOKUP('Input Sheet'!$I9,TechNumber,2,FALSE)),\"\",VLOOKUP('Input Sheet'!$I9,TechNumber,2,FALSE))","v":""},"",null,null,null,{"$f":"IF(ISERROR(VLOOKUP('Input Sheet'!$N9,TechNumber,2,FALSE)),\"\",VLOOKUP('Input Sheet'!$N9,TechNumber,2,FALSE))","v":""}," ",null,null,null,{"$f":"IF(ISERROR(VLOOKUP('Input Sheet'!$S9,TechNumber,2,FALSE)),\"\",VLOOKUP('Input Sheet'!$S9,TechNumber,2,FALSE))","v":""},"",0]
[null,5,null,null,null,null,null,null,null,{"$f":"IF(ISERROR(VLOOKUP('Input Sheet'!$I10,TechNumber,2,FALSE)),\"\",VLOOKUP('Input Sheet'!$I10,TechNumber,2,FALSE))","v":""},{"$f":"IF(ISERROR(H10*J10),\"\",H10*J10)","v":""},null,null,null,{"$f":"IF(ISERROR(VLOOKUP('Input Sheet'!$N10,TechNumber,2,FALSE)),\"\",VLOOKUP('Input Sheet'!$N10,TechNumber,2,FALSE))","v":""}," ",null,null,null,{"$f":"IF(ISERROR(VLOOKUP('Input Sheet'!$S10,TechNumber,2,FALSE)),\"\",VLOOKUP('Input Sheet'!$S10,TechNumber,2,FALSE))","v":""},"",0]
[null,6,null,null,null,null,null,null,null,{"$f":"IF(ISERROR(VLOOKUP('Input Sheet'!$I11,TechNumber,2,FALSE)),\"\",VLOOKUP('Input Sheet'!$I11,TechNumber,2,FALSE))","v":""},"",null,null,null,{"$f":"IF(ISERROR(VLOOKUP('Input Sheet'!$N11,TechNumber,2,FALSE)),\"\",VLOOKUP('Input Sheet'!$N11,TechNumber,2,FALSE))","v":""}," ",null,null,null,{"$f":"IF(ISERROR(VLOOKUP('Input Sheet'!$S11,TechNumber,2,FALSE)),\"\",VLOOKUP('Input Sheet'!$S11,TechNumber,2,FALSE))","v":""},"",0]
[null,7,null,null,null,null,null,null,null,{"$f":"IF(ISERROR(VLOOKUP('Input Sheet'!$I12,TechNumber,2,FALSE)),\"\",VLOOKUP('Input Sheet'!$I12,TechNumber,2,FALSE))","v":""},"",null,null,null,{"$f":"IF(ISERROR(VLOOKUP('Input Sheet'!$N12,TechNumber,2,FALSE)),\"\",VLOOKUP('Input Sheet'!$N12,TechNumber,2,FALSE))","v":""}," ",null,null,null,{"$f":"IF(ISERROR(VLOOKUP('Input Sheet'!$S12,TechNumber,2,FALSE)),\"\",VLOOKUP('Input Sheet'!$S12,TechNumber,2,FALSE))","v":""},"",0]
[null,8,null,null,null,null,null,null,null,{"$f":"IF(ISERROR(VLOOKUP('Input Sheet'!$I13,TechNumber,2,FALSE)),\"\",VLOOKUP('Input Sheet'!$I13,TechNumber,2,FALSE))","v":""},"",null,null,null,{"$f":"IF(ISERROR(VLOOKUP('Input Sheet'!$N13,TechNumber,2,FALSE)),\"\",VLOOKUP('Input Sheet'!$N13,TechNumber,2,FALSE))","v":""}," ",null,null,null,{"$f":"IF(ISERROR(VLOOKUP('Input Sheet'!$S13,TechNumber,2,FALSE)),\"\",VLOOKUP('Input Sheet'!$S13,TechNumber,2,FALSE))","v":""},"",0]
[null,9,null,null,null,null,null,null,null,{"$f":"IF(ISERROR(VLOOKUP('Input Sheet'!$I14,TechNumber,2,FALSE)),\"\",VLOOKUP('Input Sheet'!$I14,TechNumber,2,FALSE))","v":""},"",null,null,null,{"$f":"IF(ISERROR(VLOOKUP('Input Sheet'!$N14,TechNumber,2,FALSE)),\"\",VLOOKUP('Input Sheet'!$N14,TechNumber,2,FALSE))","v":""}," ",null,null,null,{"$f":"IF(ISERROR(VLOOKUP('Input Sheet'!$S14,TechNumber,2,FALSE)),\"\",VLOOKUP('Input Sheet'!$S14,TechNumber,2,FALSE))","v":""},"",0]
[null,10,null,null,null,null,null,null,null,{"$f":"IF(ISERROR(VLOOKUP('Input Sheet'!$I15,TechNumber,2,FALSE)),\"\",VLOOKUP('Input Sheet'!$I15,TechNumber,2,FALSE))","v":""},"",null,null,null,{"$f":"IF(ISERROR(VLOOKUP('Input Sheet'!$N15,TechNumber,2,FALSE)),\"\",VLOOKUP('Input Sheet'!$N15,TechNumber,2,FALSE))","v":""}," ",null,null,null,{"$f":"IF(ISERROR(VLOOKUP('Input Sheet'!$S15,TechNumber,2,FALSE)),\"\",VLOOKUP('Input Sheet'!$S15,TechNumber,2,FALSE))","v":""},"",0]
{"$rows_left_out":99}
{"sheet":"RO Report 1-50","index":3,"n_rows":65,"n_cols":21,"rows_kept":65,"cut":false,"hidden":false,"merged":[[1,0,1,3],[0,0,0,20],[3,7,4,7],[3,8,4,8],[3,9,4,9],[3,10,4,10],[3,0,4,0],[3,4,4,4],[3,5,4,5],[3,6,4,6],[3,15,4,15],[2,20,4,20],[2,0,2,3],[1,4,2,8],[1,9,2,13],[1,14,2,18],[57,18,58,18],[56,4,56,8],[56,9,56,13],[56,14,56,18],[3,12,4,12],[3,13,4,13],[3,14,4,14],[56,20,58,20],[57,4,58,4],[57,5,58,5],[57,6,58,6],[57,7,58,7],[57,8,58,8],[57,9,58,9],[57,10,58,10],[57,11,58,11],[57,12,58,12],[56,19,58,19],[57,13,58,13],[57,14,58,14],[57,15,58,15],[57,16,58,16],[57,17,58,17],[2,19,4,19],[3,11,4,11],[3,18,4,18],[3,16,4,16],[3,17,4,17]]}
["Repair Order Analysis"]
[null,null,null,null,"Competitive Labor",null,null,null,null,"Maintenance Labor",null,null,null,null,"Repair Labor"]
["Dealership",null,null,null,null,null,null,null,null,null,null,null,null,null,null,null,null,null,null,"Total Cost of Labor","One Item Repair Order"]
["RO Number",null,null,null,"Labor Sales","Flat Rate Hours","Technician Number","Pay Per FRH","Labor Cost ","Labor Sales","Flat Rate Hours","Technician Number","Pay Per FRH","Labor Cost ","Labor Sales","Flat Rate Hours","Technician Number","Pay Per FRH","Labor Cost "]
[null,"Year","Model ","Mileage"]
[{"$f":"'Input Sheet'!C6","v":0},{"$f":"'Input Sheet'!D6","v":0},{"$f":"'Input Sheet'!E6","v":0},{"$f":"'Input Sheet'!F6","v":0},{"$f":"'Input Sheet'!G6","v":0},{"$f":"'Input Sheet'!H6","v":0},{"$f":"'Input Sheet'!I6","v":0},{"$f":"'Input Sheet'!J6","v":""},{"$f":"F6*H6","v":{"$error":"#VALUE!"}},{"$f":"'Input Sheet'!L6","v":0},{"$f":"'Input Sheet'!M6","v":0},{"$f":"'Input Sheet'!I6","v":0},{"$f":"'Input Sheet'!J6","v":""},{"$f":"K6*M6","v":{"$error":"#VALUE!"}},{"$f":"'Input Sheet'!Q6","v":0},{"$f":"'Input Sheet'!R6","v":0},{"$f":"'Input Sheet'!S6","v":0},{"$f":"'Input Sheet'!T6","v":""},{"$f":"P6*R6","v":{"$error":"#VALUE!"}},{"$f":"'Input Sheet'!V6","v":0},{"$f":"'Input Sheet'!W6","v":0}]
[{"$f":"'Input Sheet'!C7","v":0},{"$f":"'Input Sheet'!D7","v":0},{"$f":"'Input Sheet'!E7","v":0},{"$f":"'Input Sheet'!F7","v":0},{"$f":"'Input Sheet'!G7","v":0},{"$f":"'Input Sheet'!H7","v":0},{"$f":"'Input Sheet'!I7","v":0},{"$f":"'Input Sheet'!J7","v":""},{"$f":"F7*H7","v":{"$error":"#VALUE!"}},{"$f":"'Input Sheet'!L7","v":0},{"$f":"'Input Sheet'!M7","v":0},{"$f":"'Input Sheet'!I7","v":0},{"$f":"'Input Sheet'!J7","v":""},{"$f":"K7*M7","v":{"$error":"#VALUE!"}},{"$f":"'Input Sheet'!Q7","v":0},{"$f":"'Input Sheet'!R7","v":0},{"$f":"'Input Sheet'!S7","v":0},{"$f":"'Input Sheet'!T7","v":""},{"$f":"P7*R7","v":{"$error":"#VALUE!"}},{"$f":"'Input Sheet'!V7","v":0},{"$f":"'Input Sheet'!W7","v":0}]
[{"$f":"'Input Sheet'!C8","v":0},{"$f":"'Input Sheet'!D8","v":0},{"$f":"'Input Sheet'!E8","v":0},{"$f":"'Input Sheet'!F8","v":0},{"$f":"'Input Sheet'!G8","v":0},{"$f":"'Input Sheet'!H8","v":0},{"$f":"'Input Sheet'!I8","v":0},{"$f":"'Input Sheet'!J8","v":""},{"$error":"#VALUE!"},{"$f":"'Input Sheet'!L8","v":0},{"$f":"'Input Sheet'!M8","v":0},{"$f":"'Input Sheet'!I8","v":0},{"$f":"'Input Sheet'!J8","v":""},{"$error":"#VALUE!"},{"$f":"'Input Sheet'!Q8","v":0},{"$f":"'Input Sheet'!R8","v":0},{"$f":"'Input Sheet'!S8","v":0},{"$f":"'Input Sheet'!T8","v":""},{"$error":"#VALUE!"},{"$f":"'Input Sheet'!V8","v":0},{"$f":"'Input Sheet'!W8","v":0}]
[{"$f":"'Input Sheet'!C9","v":0},{"$f":"'Input Sheet'!D9","v":0},{"$f":"'Input Sheet'!E9","v":0},{"$f":"'Input Sheet'!F9","v":0},{"$f":"'Input Sheet'!G9","v":0},{"$f":"'Input Sheet'!H9","v":0},{"$f":"'Input Sheet'!I9","v":0},{"$f":"'Input Sheet'!J9","v":""},{"$error":"#VALUE!"},{"$f":"'Input Sheet'!L9","v":0},{"$f":"'Input Sheet'!M9","v":0},{"$f":"'Input Sheet'!I9","v":0},{"$f":"'Input Sheet'!J9","v":""},{"$error":"#VALUE!"},{"$f":"'Input Sheet'!Q9","v":0},{"$f":"'Input Sheet'!R9","v":0},{"$f":"'Input Sheet'!S9","v":0},{"$f":"'Input Sheet'!T9","v":""},{"$error":"#VALUE!"},{"$f":"'Input Sheet'!V9","v":0},{"$f":"'Input Sheet'!W9","v":0}]
[{"$f":"'Input Sheet'!C10","v":0},{"$f":"'Input Sheet'!D10","v":0},{"$f":"'Input Sheet'!E10","v":0},{"$f":"'Input Sheet'!F10","v":0},{"$f":"'Input Sheet'!G10","v":0},{"$f":"'Input Sheet'!H10","v":0},{"$f":"'Input Sheet'!I10","v":0},{"$f":"'Input Sheet'!J10","v":""},{"$error":"#VALUE!"},{"$f":"'Input Sheet'!L10","v":0},{"$f":"'Input Sheet'!M10","v":0},{"$f":"'Input Sheet'!I10","v":0},{"$f":"'Input Sheet'!J10","v":""},{"$error":"#VALUE!"},{"$f":"'Input Sheet'!Q10","v":0},{"$f":"'Input Sheet'!R10","v":0},{"$f":"'Input Sheet'!S10","v":0},{"$f":"'Input Sheet'!T10","v":""},{"$error":"#VALUE!"},{"$f":"'Input Sheet'!V10","v":0},{"$f":"'Input Sheet'!W10","v":0}]
[{"$f":"'Input Sheet'!C11","v":0},{"$f":"'Input Sheet'!D11","v":0},{"$f":"'Input Sheet'!E11","v":0},{"$f":"'Input Sheet'!F11","v":0},{"$f":"'Input Sheet'!G11","v":0},{"$f":"'Input Sheet'!H11","v":0},{"$f":"'Input Sheet'!I11","v":0},{"$f":"'Input Sheet'!J11","v":""},{"$error":"#VALUE!"},{"$f":"'Input Sheet'!L11","v":0},{"$f":"'Input Sheet'!M11","v":0},{"$f":"'Input Sheet'!I11","v":0},{"$f":"'Input Sheet'!J11","v":""},{"$error":"#VALUE!"},{"$f":"'Input Sheet'!Q11","v":0},{"$f":"'Input Sheet'!R11","v":0},{"$f":"'Input Sheet'!S11","v":0},{"$f":"'Input Sheet'!T11","v":""},{"$error":"#VALUE!"},{"$f":"'Input Sheet'!V11","v":0},{"$f":"'Input Sheet'!W11","v":0}]
[{"$f":"'Input Sheet'!C12","v":0},{"$f":"'Input Sheet'!D12","v":0},{"$f":"'Input Sheet'!E12","v":0},{"$f":"'Input Sheet'!F12","v":0},{"$f":"'Input Sheet'!G12","v":0},{"$f":"'Input Sheet'!H12","v":0},{"$f":"'Input Sheet'!I12","v":0},{"$f":"'Input Sheet'!J12","v":""},{"$error":"#VALUE!"},{"$f":"'Input Sheet'!L12","v":0},{"$f":"'Input Sheet'!M12","v":0},{"$f":"'Input Sheet'!I12","v":0},{"$f":"'Input Sheet'!J12","v":""},{"$error":"#VALUE!"},{"$f":"'Input Sheet'!Q12","v":0},{"$f":"'Input Sheet'!R12","v":0},{"$f":"'Input Sheet'!S12","v":0},{"$f":"'Input Sheet'!T12","v":""},{"$error":"#VALUE!"},{"$f":"'Input Sheet'!V12","v":0},{"$f":"'Input Sheet'!W12","v":0}]
[{"$f":"'Input Sheet'!C13","v":0},{"$f":"'Input Sheet'!D13","v":0},{"$f":"'Input Sheet'!E13","v":0},{"$f":"'Input Sheet'!F13","v":0},{"$f":"'Input Sheet'!G13","v":0},{"$f":"'Input Sheet'!H13","v":0},{"$f":"'Input Sheet'!I13","v":0},{"$f":"'Input Sheet'!J13","v":""},{"$error":"#VALUE!"},{"$f":"'Input Sheet'!L13","v":0},{"$f":"'Input Sheet'!M13","v":0},{"$f":"'Input Sheet'!I13","v":0},{"$f":"'Input Sheet'!J13","v":""},{"$error":"#VALUE!"},{"$f":"'Input Sheet'!Q13","v":0},{"$f":"'Input Sheet'!R13","v":0},{"$f":"'Input Sheet'!S13","v":0},{"$f":"'Input Sheet'!T13","v":""},{"$error":"#VALUE!"},{"$f":"'Input Sheet'!V13","v":0},{"$f":"'Input Sheet'!W13","v":0}]
[{"$f":"'Input Sheet'!C14","v":0},{"$f":"'Input Sheet'!D14","v":0},{"$f":"'Input Sheet'!E14","v":0},{"$f":"'Input Sheet'!F14","v":0},{"$f":"'Input Sheet'!G14","v":0},{"$f":"'Input Sheet'!H14","v":0},{"$f":"'Input Sheet'!I14","v":0},{"$f":"'Input Sheet'!J14","v":""},{"$error":"#VALUE!"},{"$f":"'Input Sheet'!L14","v":0},{"$f":"'Input Sheet'!M14","v":0},{"$f":"'Input Sheet'!I14","v":0},{"$f":"'Input Sheet'!J14","v":""},{"$error":"#VALUE!"},{"$f":"'Input Sheet'!Q14","v":0},{"$f":"'Input Sheet'!R14","v":0},{"$f":"'Input Sheet'!S14","v":0},{"$f":"'Input Sheet'!T14","v":""},{"$error":"#VALUE!"},{"$f":"'Input Sheet'!V14","v":0},{"$f":"'Input Sheet'!W14","v":0}]
[{"$f":"'Input Sheet'!C15","v":0},{"$f":"'Input Sheet'!D15","v":0},{"$f":"'Input Sheet'!E15","v":0},{"$f":"'Input Sheet'!F15","v":0},{"$f":"'Input Sheet'!G15","v":0},{"$f":"'Input Sheet'!H15","v":0},{"$f":"'Input Sheet'!I15","v":0},{"$f":"'Input Sheet'!J15","v":""},{"$error":"#VALUE!"},{"$f":"'Input Sheet'!L15","v":0},{"$f":"'Input Sheet'!M15","v":0},{"$f":"'Input Sheet'!I15","v":0},{"$f":"'Input Sheet'!J15","v":""},{"$error":"#VALUE!"},{"$f":"'Input Sheet'!Q15","v":0},{"$f":"'Input Sheet'!R15","v":0},{"$f":"'Input Sheet'!S15","v":0},{"$f":"'Input Sheet'!T15","v":""},{"$error":"#VALUE!"},{"$f":"'Input Sheet'!V15","v":0},{"$f":"'Input Sheet'!W15","v":0}]
{"$rows_left_out":51}
{"sheet":"RO Report 51-100","index":4,"n_rows":58,"n_cols":21,"rows_kept":58,"cut":false,"hidden":false,"merged":[[3,17,4,17],[3,18,4,18],[57,4,58,4],[57,5,58,5],[57,6,58,6],[3,6,4,6],[3,7,4,7],[3,8,4,8],[3,9,4,9],[56,4,56,8],[56,9,56,13],[3,10,4,10],[3,11,4,11],[57,12,58,12],[57,13,58,13],[57,14,58,14],[57,7,58,7],[57,8,58,8],[57,9,58,9],[57,10,58,10],[57,11,58,11],[56,19,58,19],[56,20,58,20],[57,15,58,15],[57,16,58,16],[57,17,58,17],[57,18,58,18],[56,14,56,18],[1,0,1,3],[0,0,0,20],[1,4,2,8],[1,9,2,13],[1,14,2,18],[2,0,2,3],[2,20,4,20],[3,0,4,0],[3,4,4,4],[3,5,4,5],[2,19,4,19],[3,12,4,12],[3,13,4,13],[3,14,4,14],[3,15,4,15],[3,16,4,16]]}
["Repair Order Analysis "]
[null,null,null,null,"Competitive Labor",null,null,null,null,"Maintenance Labor",null,null,null,null,"Repair Labor"]
["Dealership",null,null,null,null,null,null,null,null,null,null,null,null,null,null,null,null,null,null,"Total Cost of Labor","One Item Repair Order"]
["RO Number",null,null,null,"Labor Sales","Flat Rate Hours","Technician Number","Pay Per FRH","Labor Cost ","Labor Sales","Flat Rate Hours","Technician Number","Pay Per FRH","Labor Cost ","Labor Sales","Flat Rate Hours","Technician Number","Pay Per FRH","Labor Cost "]
[null,"Year","Model ","Mileage"]
[{"$f":"'Input Sheet'!C56","v":0},{"$f":"'Input Sheet'!D56","v":0},{"$f":"'Input Sheet'!E56","v":0},{"$f":"'Input Sheet'!F56","v":0},{"$f":"'Input Sheet'!G56","v":0},{"$f":"'Input Sheet'!H56","v":0},{"$f":"'Input Sheet'!I56","v":0},{"$f":"'Input Sheet'!J56","v":""},{"$f":"F6*H6","v":{"$error":"#VALUE!"}},{"$f":"'Input Sheet'!L56","v":0},{"$f":"'Input Sheet'!M56","v":0},{"$f":"'Input Sheet'!N56","v":0},{"$f":"'Input Sheet'!O56","v":""},{"$f":"K6*M6","v":{"$error":"#VALUE!"}},{"$f":"'Input Sheet'!Q56","v":0},{"$f":"'Input Sheet'!R56","v":0},{"$f":"'Input Sheet'!S56","v":0},{"$f":"'Input Sheet'!T56","v":""},{"$f":"P6*R6","v":{"$error":"#VALUE!"}},{"$f":"'Input Sheet'!V56","v":0},{"$f":"'Input Sheet'!W56","v":0}]
[{"$f":"'Input Sheet'!C57","v":0},{"$f":"'Input Sheet'!D57","v":0},{"$f":"'Input Sheet'!E57","v":0},{"$f":"'Input Sheet'!F57","v":0},{"$f":"'Input Sheet'!G57","v":0},{"$f":"'Input Sheet'!H57","v":0},{"$f":"'Input Sheet'!I57","v":0},{"$f":"'Input Sheet'!J57","v":""},{"$error":"#VALUE!"},{"$f":"'Input Sheet'!L57","v":0},{"$f":"'Input Sheet'!M57","v":0},{"$f":"'Input Sheet'!N57","v":0},{"$f":"'Input Sheet'!O57","v":""},{"$error":"#VALUE!"},{"$f":"'Input Sheet'!Q57","v":0},{"$f":"'Input Sheet'!R57","v":0},{"$f":"'Input Sheet'!S57","v":0},{"$f":"'Input Sheet'!T57","v":""},{"$error":"#VALUE!"},{"$f":"'Input Sheet'!V57","v":0},{"$f":"'Input Sheet'!W57","v":0}]
[{"$f":"'Input Sheet'!C58","v":0},{"$f":"'Input Sheet'!D58","v":0},{"$f":"'Input Sheet'!E58","v":0},{"$f":"'Input Sheet'!F58","v":0},{"$f":"'Input Sheet'!G58","v":0},{"$f":"'Input Sheet'!H58","v":0},{"$f":"'Input Sheet'!I58","v":0},{"$f":"'Input Sheet'!J58","v":""},{"$error":"#VALUE!"},{"$f":"'Input Sheet'!L58","v":0},{"$f":"'Input Sheet'!M58","v":0},{"$f":"'Input Sheet'!N58","v":0},{"$f":"'Input Sheet'!O58","v":""},{"$error":"#VALUE!"},{"$f":"'Input Sheet'!Q58","v":0},{"$f":"'Input Sheet'!R58","v":0},{"$f":"'Input Sheet'!S58","v":0},{"$f":"'Input Sheet'!T58","v":""},{"$error":"#VALUE!"},{"$f":"'Input Sheet'!V58","v":0},{"$f":"'Input Sheet'!W58","v":0}]
[{"$f":"'Input Sheet'!C59","v":0},{"$f":"'Input Sheet'!D59","v":0},{"$f":"'Input Sheet'!E59","v":0},{"$f":"'Input Sheet'!F59","v":0},{"$f":"'Input Sheet'!G59","v":0},{"$f":"'Input Sheet'!H59","v":0},{"$f":"'Input Sheet'!I59","v":0},{"$f":"'Input Sheet'!J59","v":""},{"$error":"#VALUE!"},{"$f":"'Input Sheet'!L59","v":0},{"$f":"'Input Sheet'!M59","v":0},{"$f":"'Input Sheet'!N59","v":0},{"$f":"'Input Sheet'!O59","v":""},{"$error":"#VALUE!"},{"$f":"'Input Sheet'!Q59","v":0},{"$f":"'Input Sheet'!R59","v":0},{"$f":"'Input Sheet'!S59","v":0},{"$f":"'Input Sheet'!T59","v":""},{"$error":"#VALUE!"},{"$f":"'Input Sheet'!V59","v":0},{"$f":"'Input Sheet'!W59","v":0}]
[{"$f":"'Input Sheet'!C60","v":0},{"$f":"'Input Sheet'!D60","v":0},{"$f":"'Input Sheet'!E60","v":0},{"$f":"'Input Sheet'!F60","v":0},{"$f":"'Input Sheet'!G60","v":0},{"$f":"'Input Sheet'!H60","v":0},{"$f":"'Input Sheet'!I60","v":0},{"$f":"'Input Sheet'!J60","v":""},{"$error":"#VALUE!"},{"$f":"'Input Sheet'!L60","v":0},{"$f":"'Input Sheet'!M60","v":0},{"$f":"'Input Sheet'!N60","v":0},{"$f":"'Input Sheet'!O60","v":""},{"$error":"#VALUE!"},{"$f":"'Input Sheet'!Q60","v":0},{"$f":"'Input Sheet'!R60","v":0},{"$f":"'Input Sheet'!S60","v":0},{"$f":"'Input Sheet'!T60","v":""},{"$error":"#VALUE!"},{"$f":"'Input Sheet'!V60","v":0},{"$f":"'Input Sheet'!W60","v":0}]
[{"$f":"'Input Sheet'!C61","v":0},{"$f":"'Input Sheet'!D61","v":0},{"$f":"'Input Sheet'!E61","v":0},{"$f":"'Input Sheet'!F61","v":0},{"$f":"'Input Sheet'!G61","v":0},{"$f":"'Input Sheet'!H61","v":0},{"$f":"'Input Sheet'!I61","v":0},{"$f":"'Input Sheet'!J61","v":""},{"$error":"#VALUE!"},{"$f":"'Input Sheet'!L61","v":0},{"$f":"'Input Sheet'!M61","v":0},{"$f":"'Input Sheet'!N61","v":0},{"$f":"'Input Sheet'!O61","v":""},{"$error":"#VALUE!"},{"$f":"'Input Sheet'!Q61","v":0},{"$f":"'Input Sheet'!R61","v":0},{"$f":"'Input Sheet'!S61","v":0},{"$f":"'Input Sheet'!T61","v":""},{"$error":"#VALUE!"},{"$f":"'Input Sheet'!V61","v":0},{"$f":"'Input Sheet'!W61","v":0}]
[{"$f":"'Input Sheet'!C62","v":0},{"$f":"'Input Sheet'!D62","v":0},{"$f":"'Input Sheet'!E62","v":0},{"$f":"'Input Sheet'!F62","v":0},{"$f":"'Input Sheet'!G62","v":0},{"$f":"'Input Sheet'!H62","v":0},{"$f":"'Input Sheet'!I62","v":0},{"$f":"'Input Sheet'!J62","v":""},{"$error":"#VALUE!"},{"$f":"'Input Sheet'!L62","v":0},{"$f":"'Input Sheet'!M62","v":0},{"$f":"'Input Sheet'!N62","v":0},{"$f":"'Input Sheet'!O62","v":""},{"$error":"#VALUE!"},{"$f":"'Input Sheet'!Q62","v":0},{"$f":"'Input Sheet'!R62","v":0},{"$f":"'Input Sheet'!S62","v":0},{"$f":"'Input Sheet'!T62","v":""},{"$error":"#VALUE!"},{"$f":"'Input Sheet'!V62","v":0},{"$f":"'Input Sheet'!W62","v":0}]
[{"$f":"'Input Sheet'!C63","v":0},{"$f":"'Input Sheet'!D63","v":0},{"$f":"'Input Sheet'!E63","v":0},{"$f":"'Input Sheet'!F63","v":0},{"$f":"'Input Sheet'!G63","v":0},{"$f":"'Input Sheet'!H63","v":0},{"$f":"'Input Sheet'!I63","v":0},{"$f":"'Input Sheet'!J63","v":""},{"$error":"#VALUE!"},{"$f":"'Input Sheet'!L63","v":0},{"$f":"'Input Sheet'!M63","v":0},{"$f":"'Input Sheet'!N63","v":0},{"$f":"'Input Sheet'!O63","v":""},{"$error":"#VALUE!"},{"$f":"'Input Sheet'!Q63","v":0},{"$f":"'Input Sheet'!R63","v":0},{"$f":"'Input Sheet'!S63","v":0},{"$f":"'Input Sheet'!T63","v":""},{"$error":"#VALUE!"},{"$f":"'Input Sheet'!V63","v":0},{"$f":"'Input Sheet'!W63","v":0}]
[{"$f":"'Input Sheet'!C64","v":0},{"$f":"'Input Sheet'!D64","v":0},{"$f":"'Input Sheet'!E64","v":0},{"$f":"'Input Sheet'!F64","v":0},{"$f":"'Input Sheet'!G64","v":0},{"$f":"'Input Sheet'!H64","v":0},{"$f":"'Input Sheet'!I64","v":0},{"$f":"'Input Sheet'!J64","v":""},{"$error":"#VALUE!"},{"$f":"'Input Sheet'!L64","v":0},{"$f":"'Input Sheet'!M64","v":0},{"$f":"'Input Sheet'!N64","v":0},{"$f":"'Input Sheet'!O64","v":""},{"$error":"#VALUE!"},{"$f":"'Input Sheet'!Q64","v":0},{"$f":"'Input Sheet'!R64","v":0},{"$f":"'Input Sheet'!S64","v":0},{"$f":"'Input Sheet'!T64","v":""},{"$error":"#VALUE!"},{"$f":"'Input Sheet'!V64","v":0},{"$f":"'Input Sheet'!W64","v":0}]
[{"$f":"'Input Sheet'!C65","v":0},{"$f":"'Input Sheet'!D65","v":0},{"$f":"'Input Sheet'!E65","v":0},{"$f":"'Input Sheet'!F65","v":0},{"$f":"'Input Sheet'!G65","v":0},{"$f":"'Input Sheet'!H65","v":0},{"$f":"'Input Sheet'!I65","v":0},{"$f":"'Input Sheet'!J65","v":""},{"$error":"#VALUE!"},{"$f":"'Input Sheet'!L65","v":0},{"$f":"'Input Sheet'!M65","v":0},{"$f":"'Input Sheet'!N65","v":0},{"$f":"'Input Sheet'!O65","v":""},{"$error":"#VALUE!"},{"$f":"'Input Sheet'!Q65","v":0},{"$f":"'Input Sheet'!R65","v":0},{"$f":"'Input Sheet'!S65","v":0},{"$f":"'Input Sheet'!T65","v":""},{"$error":"#VALUE!"},{"$f":"'Input Sheet'!V65","v":0},{"$f":"'Input Sheet'!W65","v":0}]
{"$rows_left_out":44}
{"sheet":"Summary Report","index":5,"n_rows":28,"n_cols":12,"rows_kept":28,"cut":false,"hidden":false,"merged":[[26,11,27,11],[26,7,26,8],[28,2,28,10],[26,4,26,5],[27,4,27,5],[27,7,27,8],[11,2,11,9],[15,2,15,9],[25,4,25,5],[25,7,25,8],[24,2,24,9],[9,2,9,3],[0,2,0,10],[2,6,3,6],[2,4,3,5],[3,9,3,10],[1,2,1,10]]}
[null,null,"Repair Order Analysis Summary Report "]
[]
[null,null,null,null,"Sales in Dollars",null,"FRH's on RO's"]
[null,null,null,null,null,null,null,null,"Averages","Analysis"]
[null,null,"Competitive",null,{"$f":"'RO Report 1-50'!E56+'RO Report 51-100'!E56","v":0},"÷",{"$f":"'RO Report 1-50'!F56+'RO Report 51-100'!F56","v":0},"=",{"$f":"IF(ISERROR(E5/G5),\"\",E5/G5)","v":""},"FRH Average"]
[null,null,"Maintenance",null,{"$f":"'RO Report 1-50'!J56+'RO Report 51-100'!J56","v":0},"÷",{"$f":"'RO Report 1-50'!K56+'RO Report 51-100'!K56","v":0},"=",{"$f":"IF(ISERROR(E6/G6),\"\",E6/G6)","v":""},"FRH Average"]
[null,null,"Repair",null,{"$f":"'RO Report 1-50'!O56+'RO Report 51-100'!O56","v":0},"÷",{"$f":"'RO Report 1-50'!P56+'RO Report 51-100'!P56","v":0},"=",{"$f":"IF(ISERROR(E7/G7),\"\",E7/G7)","v":""},"FRH Average"]
[null,null,"Totals",null,{"$f":"SUM(E5:E7)","v":0},"÷",{"$f":"SUM(G5:G7)","v":0},"=",{"$f":"IF(ISERROR(E8/G8),\"\",E8/G8)","v":""},"Customer ELR"]
[null,null,null,null,null,null,null,"Target Labor Rate",null,"Per FRH"]
[null,null,"Total Ro's in Sample",null,0,null,null,"Difference",{"$f":"IF(ISERROR(I8-I9),\"\",I8-I9)","v":""},"Per FRH"]
[]
[null,null,"Cost of Labor"]
[null,null,"Total Cost of Labor",null,{"$f":"'Input Sheet'!V106","v":0},"÷","Total Sales","=",{"$f":"IF(ISERROR(E13/E8),\"\",E13/E8)","v":""},"Percent Cost of Sales"]
[null,null,"Total Cost of Labor",null,{"$f":"E13","v":0},"÷","Total FRH's","=",{"$f":"IF(ISERROR(E14/G8),\"\",E14/G8)","v":""},"Cost per FRH"]
[]
{"$rows_left_out":13}