{"text_format":"1","workbook":"xlsx","n_sheets":6,"sheets":["Title","Tech Pay","Input Sheet","RO Report 1-50","RO Report 51-100","Summary Report"],"not_rendered":{"charts":1,"images":1,"macros":1,"external_links":0,"defined_names":1,"comments":2,"pivot_tables":0},"unopened":[],"bounds":{"document_bytes":16777216,"sheet_cells":100000,"rows_first":2000,"rows_last":500,"rows_between":2000,"halvings":0,"cell_chars":16384,"cell_head_chars":4096},"cells_cut":0,"cells_raw":0,"read":"whole","date_system":"1900"}

{"sheet":"Title","index":0,"n_rows":36,"n_cols":11,"rows_kept":36,"cut":false,"hidden":false,"merged":[[15,0,15,9],[16,0,16,9],[35,7,39,9]]}
[]
[]
[]
[]
[]
[]
[]
[]
[]
[]
[]
[]
[]
[]
[]
{"$rows_left_out":22}
{"sheet":"Tech Pay","index":1,"n_rows":11,"n_cols":4,"rows_kept":11,"cut":false,"hidden":false,"merged":[]}
[null,"Tech #","Tech Pay Per FRH"]
[null,710,25]
[null,716,21]
[null,717,26]
[null,735,32]
[null,743,21]
[null,753,15.5,"          "]
[null,769,11.5]
[null,770,21]
[null,773,30]
[null,757,14]

{"sheet":"Input Sheet","index":2,"n_rows":113,"n_cols":23,"rows_kept":113,"cut":false,"hidden":false,"merged":[[2,22,4,22],[3,2,4,2],[2,16,2,20],[3,16,4,16],[3,17,4,17],[3,3,4,3],[3,4,4,4],[3,5,4,5],[1,2,1,6],[2,21,4,21],[2,6,2,10],[2,11,2,15],[3,11,4,11],[3,12,4,12],[3,13,4,13],[3,14,4,14],[3,15,4,15],[3,6,4,6],[3,7,4,7],[3,8,4,8],[3,9,4,9],[3,20,4,20],[107,18,108,18],[107,19,108,19],[107,6,108,6],[107,7,108,7],[107,8,108,8],[107,9,108,9],[107,10,108,10],[107,20,108,20],[106,21,108,21],[106,22,108,22],[106,6,106,10],[3,10,4,10],[106,11,106,15],[106,16,106,20],[107,11,108,11],[107,12,108,12],[107,13,108,13],[107,14,108,14],[107,15,108,15],[107,16,108,16],[107,17,108,17],[3,18,4,18],[3,19,4,19]]}
[]
[null,null,"Repair Order Analysis Input Sheet"]
[null,null,null,null,null,null,"Competitive Labor",null,null,null,null,"Maintenance Labor",null,null,null,null,"Repair Labor",null,null,null,null,"Total Cost of Labor","One Item Repair Order"]
[null,null,"RO Number","Year","Model ","Mileage","Labor Sales","Flat Rate Hours","Technican Number","Pay Per FRH","Labor Cost ","Labor Sales","Flat Rate Hours","Technican Number","Pay Per FRH","Labor Cost ","Labor Sales","Flat Rate Hours","Technican Number","Pay Per FRH","Labor Cost "]
[]
[null,1,150745,2011,"lacrosse",68808,22.85,0.6,753,{"$f":"IF(ISERROR(VLOOKUP('Input Sheet'!$I6,TechNumber,2,FALSE)),\"\",VLOOKUP('Input Sheet'!$I6,TechNumber,2,FALSE))","v":15.5},{"$f":"IF(ISERROR(H6*J6),\"\",H6*J6)","v":9.2999999999999989},null,null,null,{"$f":"IF(ISERROR(VLOOKUP('Input Sheet'!#REF!,TechNumber,2,FALSE)),\"\",VLOOKUP('Input Sheet'!#REF!,TechNumber,2,FALSE))","v":""},{"$f":"IF(ISERROR(#REF!*O6),\" \",#REF!*O6)","v":" "},null,null,null,{"$f":"IF(ISERROR(VLOOKUP('Input Sheet'!$S6,TechNumber,2,FALSE)),\"\",VLOOKUP('Input Sheet'!$S6,TechNumber,2,FALSE))","v":""},{"$f":"IF(ISERROR(R6*T6),\"\",R6*T6)","v":""},{"$f":"SUM(U6,P6,K6)","v":9.2999999999999989},1]
[null,2,150747,2013,"sierra",57642,32.950000000000003,0.6,753,15.5,{"$f":"IF(ISERROR(H7*J7),\" \",H7*J7)","v":9.2999999999999989},null,null,null,null,null,null,null,null,{"$f":"IF(ISERROR(VLOOKUP('Input Sheet'!$S7,TechNumber,2,FALSE)),\"\",VLOOKUP('Input Sheet'!$S7,TechNumber,2,FALSE))","v":""},"",{"$f":"SUM(U7,K7,)","v":9.2999999999999989},1]
[null,3,150753,2003,"envoy",195234,22.85,0.6,753,15.5,{"$f":"IF(ISERROR(H8*J8),\" \",H8*J8)","v":9.2999999999999989},null,null,null,null,null,null,null,null,{"$f":"IF(ISERROR(VLOOKUP('Input Sheet'!$S8,TechNumber,2,FALSE)),\"\",VLOOKUP('Input Sheet'!$S8,TechNumber,2,FALSE))","v":""},"",{"$f":"SUM(U8,K8,)","v":9.2999999999999989},1]
[null,4,150756,2016,"terrain",13866,22.85,0.6,753,15.5,{"$f":"IF(ISERROR(H9*J9),\" \",H9*J9)","v":9.2999999999999989},null,null,null,null,null,null,null,null,{"$f":"IF(ISERROR(VLOOKUP('Input Sheet'!$S9,TechNumber,2,FALSE)),\"\",VLOOKUP('Input Sheet'!$S9,TechNumber,2,FALSE))","v":""},"",{"$f":"SUM(U9,K9,)","v":9.2999999999999989},1]
[null,5,150599,2009,"acadia",122461,null,null,null,{"$f":"IF(ISERROR(VLOOKUP('Input Sheet'!$I10,TechNumber,2,FALSE)),\"\",VLOOKUP('Input Sheet'!$I10,TechNumber,2,FALSE))","v":""},{"$f":"IF(ISERROR(H10*J10),\"\",H10*J10)","v":""},null,null,null,{"$f":"IF(ISERROR(VLOOKUP('Input Sheet'!$N10,TechNumber,2,FALSE)),\"\",VLOOKUP('Input Sheet'!$N10,TechNumber,2,FALSE))","v":""},{"$f":"IF(ISERROR(M10*O10),\" \",M10*O10)","v":" "},260,2,735,32,64,{"$f":"SUM(U10,P10,K10)","v":64},1]
[null,6,150603,2012,"acadia",36209,22.85,0.6,716,21,{"$f":"IF(ISERROR(H11*J11),\" \",H11*J11)","v":12.6},null,null,null,null,null,null,null,null,{"$f":"IF(ISERROR(VLOOKUP('Input Sheet'!$S11,TechNumber,2,FALSE)),\"\",VLOOKUP('Input Sheet'!$S11,TechNumber,2,FALSE))","v":""},"",{"$f":"SUM(U11,K11)","v":12.6},1]
[null,7,150612,2016,"yukon",21875,22.85,0.6,717,26,{"$f":"IF(ISERROR(H12*J12),\" \",H12*J12)","v":15.6},null,null,null,null,null,null,null,null,{"$f":"IF(ISERROR(VLOOKUP('Input Sheet'!$S12,TechNumber,2,FALSE)),\"\",VLOOKUP('Input Sheet'!$S12,TechNumber,2,FALSE))","v":""},"",{"$f":"SUM(U12,K12,)","v":15.6},1]
[null,8,150615,2016,"canyon",22702,32.950000000000003,0.6,716,21,{"$f":"IF(ISERROR(H13*J13),\" \",H13*J13)","v":12.6},null,null,null,null,null,null,null,null,{"$f":"IF(ISERROR(VLOOKUP('Input Sheet'!$S13,TechNumber,2,FALSE)),\"\",VLOOKUP('Input Sheet'!$S13,TechNumber,2,FALSE))","v":""},"",{"$f":"SUM(U13,K13,)","v":12.6},1]
[null,9,150626,2016,"yukon",21258,22.85,0.6,743,21,{"$f":"IF(ISERROR(H14*J14),\" \",H14*J14)","v":12.6},null,null,null,null,null,null,null,null,{"$f":"IF(ISERROR(VLOOKUP('Input Sheet'!$S14,TechNumber,2,FALSE)),\"\",VLOOKUP('Input Sheet'!$S14,TechNumber,2,FALSE))","v":""},"",{"$f":"SUM(U14,K14)","v":12.6},1]
[null,10,150631,2011,"lacrosse",87727,null,null,null,{"$f":"IF(ISERROR(VLOOKUP('Input Sheet'!$I15,TechNumber,2,FALSE)),\"\",VLOOKUP('Input Sheet'!$I15,TechNumber,2,FALSE))","v":""},{"$f":"IF(ISERROR(H15*J15),\"\",H15*J15)","v":""},217.85,2.1,717,{"$f":"IF(ISERROR(VLOOKUP('Input Sheet'!$N15,TechNumber,2,FALSE)),\"\",VLOOKUP('Input Sheet'!$N15,TechNumber,2,FALSE))","v":26},{"$f":"IF(ISERROR(M15*O15),\"\",M15*O15)","v":54.6},null,null,null,null,null,{"$f":"SUM(P15,K15)","v":54.6},2]
{"$rows_left_out":99}
{"sheet":"RO Report 1-50","index":3,"n_rows":65,"n_cols":23,"rows_kept":65,"cut":false,"hidden":false,"merged":[[2,19,4,19],[3,11,4,11],[3,18,4,18],[3,16,4,16],[3,17,4,17],[56,20,58,20],[57,4,58,4],[57,5,58,5],[57,6,58,6],[57,7,58,7],[57,8,58,8],[57,9,58,9],[57,10,58,10],[57,11,58,11],[57,12,58,12],[56,19,58,19],[57,13,58,13],[57,14,58,14],[57,15,58,15],[57,16,58,16],[57,17,58,17],[57,18,58,18],[56,4,56,8],[56,9,56,13],[56,14,56,18],[3,12,4,12],[3,13,4,13],[3,14,4,14],[1,0,1,3],[0,0,0,20],[3,7,4,7],[3,8,4,8],[3,9,4,9],[3,10,4,10],[3,0,4,0],[3,4,4,4],[3,5,4,5],[3,6,4,6],[3,15,4,15],[2,20,4,20],[2,0,2,3],[1,4,2,8],[1,9,2,13],[1,14,2,18]]}
["Repair Order Analysis"]
[null,null,null,null,"Competitive Labor",null,null,null,null,"Maintenance Labor",null,null,null,null,"Repair Labor"]
["Dealership",null,null,null,null,null,null,null,null,null,null,null,null,null,null,null,null,null,null,"Total Cost of Labor","One Item Repair Order"]
["RO Number",null,null,null,"Labor Sales","Flat Rate Hours","Technician Number","Pay Per FRH","Labor Cost ","Labor Sales","Flat Rate Hours","Technician Number","Pay Per FRH","Labor Cost ","Labor Sales","Flat Rate Hours","Technician Number","Pay Per FRH","Labor Cost "]
[null,"Year","Model ","Mileage"]
[{"$f":"'Input Sheet'!C6","v":150745},{"$f":"'Input Sheet'!D6","v":2011},{"$f":"'Input Sheet'!E6","v":"lacrosse"},{"$f":"'Input Sheet'!F6","v":68808},{"$f":"'Input Sheet'!G6","v":22.85},{"$f":"'Input Sheet'!H6","v":0.6},{"$f":"'Input Sheet'!I6","v":753},{"$f":"'Input Sheet'!J6","v":15.5},{"$f":"F6*H6","v":9.2999999999999989},0,0,{"$f":"'Input Sheet'!I6","v":753},{"$f":"'Input Sheet'!J6","v":15.5},{"$f":"K6*M6","v":0},{"$f":"'Input Sheet'!Q6","v":0},{"$f":"'Input Sheet'!R6","v":0},{"$f":"'Input Sheet'!S6","v":0},{"$f":"'Input Sheet'!T6","v":""},{"$f":"P6*R6","v":{"$error":"#VALUE!"}},{"$f":"'Input Sheet'!V6","v":9.2999999999999989},{"$f":"'Input Sheet'!W6","v":1}]
[{"$f":"'Input Sheet'!C7","v":150747},{"$f":"'Input Sheet'!D7","v":2013},{"$f":"'Input Sheet'!E7","v":"sierra"},{"$f":"'Input Sheet'!F7","v":57642},{"$f":"'Input Sheet'!G7","v":32.950000000000003},{"$f":"'Input Sheet'!H6","v":0.6},{"$f":"'Input Sheet'!#REF!","v":{"$error":"#REF!"}},{"$f":"'Input Sheet'!#REF!","v":{"$error":"#REF!"}},{"$f":"F7*H7","v":{"$error":"#REF!"}},0,0,{"$f":"'Input Sheet'!#REF!","v":{"$error":"#REF!"}},{"$f":"'Input Sheet'!#REF!","v":{"$error":"#REF!"}},{"$f":"K7*M7","v":{"$error":"#REF!"}},{"$f":"'Input Sheet'!Q7","v":0},{"$f":"'Input Sheet'!R7","v":0},{"$f":"'Input Sheet'!S7","v":0},{"$f":"'Input Sheet'!T7","v":""},{"$f":"P7*R7","v":{"$error":"#VALUE!"}},{"$f":"'Input Sheet'!V7","v":9.2999999999999989},{"$f":"'Input Sheet'!W7","v":1}]
[{"$f":"'Input Sheet'!C8","v":150753},{"$f":"'Input Sheet'!D8","v":2003},{"$f":"'Input Sheet'!E8","v":"envoy"},{"$f":"'Input Sheet'!F8","v":195234},{"$f":"'Input Sheet'!G8","v":22.85},{"$f":"'Input Sheet'!H7","v":0.6},{"$f":"'Input Sheet'!#REF!","v":{"$error":"#REF!"}},{"$f":"'Input Sheet'!#REF!","v":{"$error":"#REF!"}},{"$error":"#REF!"},0,0,{"$f":"'Input Sheet'!#REF!","v":{"$error":"#REF!"}},{"$f":"'Input Sheet'!#REF!","v":{"$error":"#REF!"}},{"$error":"#REF!"},{"$f":"'Input Sheet'!Q8","v":0},{"$f":"'Input Sheet'!R8","v":0},{"$f":"'Input Sheet'!S8","v":0},{"$f":"'Input Sheet'!T8","v":""},{"$error":"#VALUE!"},{"$f":"'Input Sheet'!V8","v":9.2999999999999989},{"$f":"'Input Sheet'!W8","v":1}]
[{"$f":"'Input Sheet'!C9","v":150756},{"$f":"'Input Sheet'!D9","v":2016},{"$f":"'Input Sheet'!E9","v":"terrain"},{"$f":"'Input Sheet'!F9","v":13866},{"$f":"'Input Sheet'!G9","v":22.85},{"$f":"'Input Sheet'!H8","v":0.6},{"$f":"'Input Sheet'!#REF!","v":{"$error":"#REF!"}},{"$f":"'Input Sheet'!#REF!","v":{"$error":"#REF!"}},{"$error":"#REF!"},0,0,{"$f":"'Input Sheet'!#REF!","v":{"$error":"#REF!"}},{"$f":"'Input Sheet'!#REF!","v":{"$error":"#REF!"}},{"$error":"#REF!"},{"$f":"'Input Sheet'!Q9","v":0},{"$f":"'Input Sheet'!R9","v":0},{"$f":"'Input Sheet'!S9","v":0},{"$f":"'Input Sheet'!T9","v":""},{"$error":"#VALUE!"},{"$f":"'Input Sheet'!V9","v":9.2999999999999989},{"$f":"'Input Sheet'!W9","v":1}]
[{"$f":"'Input Sheet'!C10","v":150599},{"$f":"'Input Sheet'!D10","v":2009},{"$f":"'Input Sheet'!E10","v":"acadia"},{"$f":"'Input Sheet'!F10","v":122461},{"$f":"'Input Sheet'!G10","v":0},{"$f":"'Input Sheet'!H10","v":0},{"$f":"'Input Sheet'!I10","v":0},{"$f":"'Input Sheet'!J10","v":""},{"$error":"#VALUE!"},{"$f":"'Input Sheet'!L10","v":0},{"$f":"'Input Sheet'!M10","v":0},{"$f":"'Input Sheet'!I10","v":0},{"$f":"'Input Sheet'!J10","v":""},{"$error":"#VALUE!"},{"$f":"'Input Sheet'!Q10","v":260},{"$f":"'Input Sheet'!R10","v":2},{"$f":"'Input Sheet'!S10","v":735},{"$f":"'Input Sheet'!T10","v":32},64,{"$f":"'Input Sheet'!V10","v":64},{"$f":"'Input Sheet'!W10","v":1}]
[{"$f":"'Input Sheet'!C11","v":150603},{"$f":"'Input Sheet'!D11","v":2012},{"$f":"'Input Sheet'!E11","v":"acadia"},{"$f":"'Input Sheet'!F11","v":36209},{"$f":"'Input Sheet'!G11","v":22.85},{"$f":"'Input Sheet'!H10","v":0},{"$f":"'Input Sheet'!#REF!","v":{"$error":"#REF!"}},{"$f":"'Input Sheet'!#REF!","v":{"$error":"#REF!"}},{"$error":"#REF!"},0,0,{"$f":"'Input Sheet'!#REF!","v":{"$error":"#REF!"}},{"$f":"'Input Sheet'!#REF!","v":{"$error":"#REF!"}},{"$error":"#REF!"},{"$f":"'Input Sheet'!Q11","v":0},{"$f":"'Input Sheet'!R11","v":0},{"$f":"'Input Sheet'!S11","v":0},{"$f":"'Input Sheet'!T11","v":""},{"$error":"#VALUE!"},{"$f":"'Input Sheet'!V11","v":12.6},{"$f":"'Input Sheet'!W11","v":1},null," "]
[{"$f":"'Input Sheet'!C12","v":150612},{"$f":"'Input Sheet'!D12","v":2016},{"$f":"'Input Sheet'!E12","v":"yukon"},{"$f":"'Input Sheet'!F12","v":21875},{"$f":"'Input Sheet'!G12","v":22.85},{"$f":"'Input Sheet'!R11","v":0},{"$f":"'Input Sheet'!#REF!","v":{"$error":"#REF!"}},{"$f":"'Input Sheet'!#REF!","v":{"$error":"#REF!"}},{"$error":"#REF!"},0,0,{"$f":"'Input Sheet'!#REF!","v":{"$error":"#REF!"}},{"$f":"'Input Sheet'!#REF!","v":{"$error":"#REF!"}},{"$error":"#REF!"},{"$f":"'Input Sheet'!Q12","v":0},{"$f":"'Input Sheet'!R12","v":0},{"$f":"'Input Sheet'!S12","v":0},{"$f":"'Input Sheet'!T12","v":""},{"$error":"#VALUE!"},{"$f":"'Input Sheet'!V12","v":15.6},{"$f":"'Input Sheet'!W12","v":1}]
[{"$f":"'Input Sheet'!C13","v":150615},{"$f":"'Input Sheet'!D13","v":2016},{"$f":"'Input Sheet'!E13","v":"canyon"},{"$f":"'Input Sheet'!F13","v":22702},{"$f":"'Input Sheet'!G13","v":32.950000000000003},{"$f":"'Input Sheet'!R12","v":0},{"$f":"'Input Sheet'!#REF!","v":{"$error":"#REF!"}},{"$f":"'Input Sheet'!#REF!","v":{"$error":"#REF!"}},{"$error":"#REF!"},0,0,{"$f":"'Input Sheet'!#REF!","v":{"$error":"#REF!"}},{"$f":"'Input Sheet'!#REF!","v":{"$error":"#REF!"}},{"$error":"#REF!"},{"$f":"'Input Sheet'!Q13","v":0},{"$f":"'Input Sheet'!R13","v":0},{"$f":"'Input Sheet'!S13","v":0},{"$f":"'Input Sheet'!T13","v":""},{"$error":"#VALUE!"},{"$f":"'Input Sheet'!V13","v":12.6},{"$f":"'Input Sheet'!W13","v":1}]
[{"$f":"'Input Sheet'!C14","v":150626},{"$f":"'Input Sheet'!D14","v":2016},{"$f":"'Input Sheet'!E14","v":"yukon"},{"$f":"'Input Sheet'!F14","v":21258},{"$f":"'Input Sheet'!G14","v":22.85},{"$f":"'Input Sheet'!H15","v":0},{"$f":"'Input Sheet'!#REF!","v":{"$error":"#REF!"}},{"$f":"'Input Sheet'!#REF!","v":{"$error":"#REF!"}},{"$error":"#REF!"},0,0,{"$f":"'Input Sheet'!#REF!","v":{"$error":"#REF!"}},{"$f":"'Input Sheet'!#REF!","v":{"$error":"#REF!"}},{"$error":"#REF!"},{"$f":"'Input Sheet'!Q14","v":0},{"$f":"'Input Sheet'!R14","v":0},{"$f":"'Input Sheet'!S14","v":0},{"$f":"'Input Sheet'!T14","v":""},{"$error":"#VALUE!"},{"$f":"'Input Sheet'!V14","v":12.6},{"$f":"'Input Sheet'!W14","v":1}]
[{"$f":"'Input Sheet'!C15","v":150631},{"$f":"'Input Sheet'!D15","v":2011},{"$f":"'Input Sheet'!E15","v":"lacrosse"},{"$f":"'Input Sheet'!F15","v":87727},{"$f":"'Input Sheet'!G15","v":0},{"$f":"'Input Sheet'!H15","v":0},{"$f":"'Input Sheet'!I15","v":0},{"$f":"'Input Sheet'!J15","v":""},{"$error":"#VALUE!"},217.85,2.1,{"$f":"'Input Sheet'!I15","v":0},{"$f":"'Input Sheet'!J15","v":""},{"$error":"#VALUE!"},{"$f":"'Input Sheet'!L15","v":217.85},{"$f":"'Input Sheet'!M15","v":2.1},{"$f":"'Input Sheet'!N15","v":717},{"$f":"'Input Sheet'!O15","v":26},54.6,{"$f":"'Input Sheet'!V15","v":54.6},{"$f":"'Input Sheet'!W15","v":2}]
{"$rows_left_out":51}
{"sheet":"RO Report 51-100","index":4,"n_rows":58,"n_cols":21,"rows_kept":58,"cut":false,"hidden":false,"merged":[[1,0,1,3],[0,0,0,20],[1,4,2,8],[1,9,2,13],[1,14,2,18],[2,0,2,3],[2,20,4,20],[3,0,4,0],[3,4,4,4],[3,5,4,5],[2,19,4,19],[3,12,4,12],[3,13,4,13],[3,14,4,14],[3,15,4,15],[3,16,4,16],[56,19,58,19],[56,20,58,20],[57,15,58,15],[57,16,58,16],[57,17,58,17],[57,18,58,18],[56,14,56,18],[57,7,58,7],[57,8,58,8],[57,9,58,9],[57,10,58,10],[57,11,58,11],[3,17,4,17],[3,18,4,18],[57,4,58,4],[57,5,58,5],[57,6,58,6],[3,6,4,6],[3,7,4,7],[3,8,4,8],[3,9,4,9],[56,4,56,8],[56,9,56,13],[3,10,4,10],[3,11,4,11],[57,12,58,12],[57,13,58,13],[57,14,58,14]]}
["Repair Order Analysis "]
[null,null,null,null,"Competitive Labor",null,null,null,null,"Maintenance Labor",null,null,null,null,"Repair Labor"]
["Dealership",null,null,null,null,null,null,null,null,null,null,null,null,null,null,null,null,null,null,"Total Cost of Labor","One Item Repair Order"]
["RO Number",null,null,null,"Labor Sales","Flat Rate Hours","Technician Number","Pay Per FRH","Labor Cost ","Labor Sales","Flat Rate Hours","Technician Number","Pay Per FRH","Labor Cost ","Labor Sales","Flat Rate Hours","Technician Number","Pay Per FRH","Labor Cost "]
[null,"Year","Model ","Mileage"]
[151870,2001,"corvette",82756,{"$f":"'Input Sheet'!G56","v":0},{"$f":"'Input Sheet'!H56","v":0},{"$f":"'Input Sheet'!I56","v":0},{"$f":"'Input Sheet'!J56","v":""},{"$f":"F6*H6","v":{"$error":"#VALUE!"}},{"$f":"'Input Sheet'!L56","v":0},{"$f":"'Input Sheet'!M56","v":0},{"$f":"'Input Sheet'!N56","v":0},{"$f":"'Input Sheet'!O56","v":""},{"$f":"K6*M6","v":{"$error":"#VALUE!"}},74.849999999999994,0.8,{"$f":"'Input Sheet'!S56","v":735},{"$f":"'Input Sheet'!T56","v":32},{"$f":"P6*R6","v":25.6},28,3]
["152414*",2014,"sierra 1500",54400,{"$f":"'Input Sheet'!G57","v":0},{"$f":"'Input Sheet'!H57","v":0},{"$f":"'Input Sheet'!I57","v":0},{"$f":"'Input Sheet'!J57","v":""},{"$error":"#VALUE!"},{"$f":"'Input Sheet'!L57","v":0},{"$f":"'Input Sheet'!M57","v":0},{"$f":"'Input Sheet'!N57","v":0},{"$f":"'Input Sheet'!O57","v":""},{"$error":"#VALUE!"},2054.64,2.7,{"$f":"'Input Sheet'!S57","v":735},{"$f":"'Input Sheet'!T57","v":32},86.4,94.5,4]
[152548,2006,"yukon xl",179745,{"$f":"'Input Sheet'!G58","v":0},{"$f":"'Input Sheet'!H58","v":0},{"$f":"'Input Sheet'!I58","v":0},{"$f":"'Input Sheet'!J58","v":""},{"$error":"#VALUE!"},{"$f":"'Input Sheet'!L58","v":0},{"$f":"'Input Sheet'!M58","v":0},{"$f":"'Input Sheet'!N58","v":0},{"$f":"'Input Sheet'!O58","v":""},{"$error":"#VALUE!"},1066.18,6.5,{"$f":"'Input Sheet'!S58","v":735},{"$f":"'Input Sheet'!T58","v":32},208,227.5,4]
[152555,2007,"Hummer H3",113405,0,0,{"$f":"'Input Sheet'!I59","v":0},{"$f":"'Input Sheet'!J59","v":""},{"$error":"#VALUE!"},{"$f":"'Input Sheet'!L59","v":0},{"$f":"'Input Sheet'!M59","v":0},{"$f":"'Input Sheet'!N59","v":0},{"$f":"'Input Sheet'!O59","v":""},{"$error":"#VALUE!"},1188.8800000000001,8.1,{"$f":"'Input Sheet'!S59","v":743},{"$f":"'Input Sheet'!T59","v":21},170.1,157.5,4]
[152677,2014,"Camaro",61516,0,0,{"$f":"'Input Sheet'!I60","v":0},{"$f":"'Input Sheet'!J60","v":""},{"$error":"#VALUE!"},182.08,1.6,{"$f":"'Input Sheet'!N60","v":743},{"$f":"'Input Sheet'!O60","v":21},33.6,{"$f":"'Input Sheet'!Q60","v":0},{"$f":"'Input Sheet'!R60","v":0},{"$f":"'Input Sheet'!S60","v":0},{"$f":"'Input Sheet'!T60","v":""},{"$error":"#VALUE!"},182.08,3]
[152736,2012,"Yukon XL",78856,0,0,{"$f":"'Input Sheet'!I61","v":0},{"$f":"'Input Sheet'!J61","v":""},{"$error":"#VALUE!"},0,0,{"$f":"'Input Sheet'!N61","v":0},{"$f":"'Input Sheet'!O61","v":""},{"$error":"#VALUE!"},1286.96,5.6,{"$f":"'Input Sheet'!S61","v":735},{"$f":"'Input Sheet'!T61","v":32},179.2,196,4]
[152745,2005,"Yukon ",149595,{"$f":"'Input Sheet'!G62","v":0},{"$f":"'Input Sheet'!H62","v":0},{"$f":"'Input Sheet'!I62","v":0},{"$f":"'Input Sheet'!J62","v":""},{"$error":"#VALUE!"},{"$f":"'Input Sheet'!L62","v":0},{"$f":"'Input Sheet'!M62","v":0},{"$f":"'Input Sheet'!N62","v":0},{"$f":"'Input Sheet'!O62","v":""},{"$error":"#VALUE!"},1450.79,1.5,{"$f":"'Input Sheet'!S62","v":770},{"$f":"'Input Sheet'!T62","v":21},31.5,195,1]
[152770,2016,"Canyon",17468,0,0,{"$f":"'Input Sheet'!I63","v":0},{"$f":"'Input Sheet'!J63","v":""},{"$error":"#VALUE!"},{"$f":"'Input Sheet'!L63","v":0},{"$f":"'Input Sheet'!M63","v":0},{"$f":"'Input Sheet'!N63","v":0},{"$f":"'Input Sheet'!O63","v":""},{"$error":"#VALUE!"},920.32,6.6,{"$f":"'Input Sheet'!S63","v":717},{"$f":"'Input Sheet'!T63","v":26},171.6,156,1]
[152790,2001,"Safari",225023,{"$f":"'Input Sheet'!G64","v":0},{"$f":"'Input Sheet'!H64","v":0},{"$f":"'Input Sheet'!I64","v":0},{"$f":"'Input Sheet'!J64","v":""},{"$error":"#VALUE!"},591.71,2,{"$f":"'Input Sheet'!N64","v":773},{"$f":"'Input Sheet'!O64","v":30},60,{"$f":"'Input Sheet'!Q64","v":0},{"$f":"'Input Sheet'!R64","v":0},{"$f":"'Input Sheet'!S64","v":0},{"$f":"'Input Sheet'!T64","v":""},{"$error":"#VALUE!"},60,2]
[152791,2003,"Yukon XL",151524,0,0,{"$f":"'Input Sheet'!I65","v":0},{"$f":"'Input Sheet'!J65","v":""},{"$error":"#VALUE!"},152.69999999999999,1.8,{"$f":"'Input Sheet'!N65","v":710},{"$f":"'Input Sheet'!O65","v":25},45,{"$f":"'Input Sheet'!Q65","v":0},{"$f":"'Input Sheet'!R65","v":0},{"$f":"'Input Sheet'!S65","v":0},{"$f":"'Input Sheet'!T65","v":""},{"$error":"#VALUE!"},30,3]
{"$rows_left_out":44}
{"sheet":"Summary Report","index":5,"n_rows":28,"n_cols":12,"rows_kept":28,"cut":false,"hidden":false,"merged":[[9,2,9,3],[0,2,0,10],[2,6,3,6],[2,4,3,5],[3,9,3,10],[1,2,1,10],[11,2,11,9],[15,2,15,9],[25,4,25,5],[25,7,25,8],[24,2,24,9],[26,11,27,11],[26,7,26,8],[28,2,28,10],[26,4,26,5],[27,4,27,5],[27,7,27,8]]}
[null,null,"Repair Order Analysis Summary Report "]
[]
[null,null,null,null,"Sales in Dollars",null,"FRH's on RO's"]
[null,null,null,null,null,null,null,null,"Averages","Analysis"]
[null,null,"Competitive",null,{"$f":"'RO Report 1-50'!E56+'RO Report 51-100'!E56","v":5766.2900000000009},"÷",{"$f":"'RO Report 1-50'!F56+'RO Report 51-100'!F56","v":43.000000000000014},"=",{"$f":"IF(ISERROR(E5/G5),\"\",E5/G5)","v":134.09976744186045},"FRH Average"]
[null,null,"Maintenance",null,{"$f":"'RO Report 1-50'!J56+'RO Report 51-100'!J56","v":5843.8799999999992},"÷",{"$f":"'RO Report 1-50'!K56+'RO Report 51-100'!K56","v":35.299999999999997},"=",{"$f":"IF(ISERROR(E6/G6),\"\",E6/G6)","v":165.54900849858356},"FRH Average"]
[null,null,"Repair",null,{"$f":"'RO Report 1-50'!O56+'RO Report 51-100'!O56","v":30031.940000000002},"÷",{"$f":"'RO Report 1-50'!P56+'RO Report 51-100'!P56","v":94.700000000000017},"=",{"$f":"IF(ISERROR(E7/G7),\"\",E7/G7)","v":317.12713833157335},"FRH Average"]
[null,null,"Totals",null,{"$f":"SUM(E5:E7)","v":41642.11},"÷",{"$f":"SUM(G5:G7)","v":173.00000000000003},"=",{"$f":"IF(ISERROR(E8/G8),\"\",E8/G8)","v":240.70583815028897},"Customer ELR"]
[null,null,null,null,null,null,null,"Target Labor Rate",130,"Per FRH"]
[null,null,"Total Ro's in Sample",null,100,null,null,"Difference",{"$f":"IF(ISERROR(I8-I9),\"\",I8-I9)","v":110.70583815028897},"Per FRH"]
[]
[null,null,"Cost of Labor"]
[null,null,"Total Cost of Labor",null,{"$f":"'Input Sheet'!V106","v":5166.1799999999994},"÷","Total Sales","=",{"$f":"IF(ISERROR(E13/E8),\"\",E13/E8)","v":0.12406143684842097},"Percent Cost of Sales"]
[null,null,"Total Cost of Labor",null,{"$f":"E13","v":5166.1799999999994},"÷","Total FRH's","=",{"$f":"IF(ISERROR(E14/G8),\"\",E14/G8)","v":29.862312138728313},"Cost per FRH"]
[]
{"$rows_left_out":13}